{"text_format":"1","workbook":"xlsx","n_sheets":2,"sheets":["Foglio1","Foglio2"],"not_rendered":{"charts":0,"images":1,"macros":1,"external_links":0,"defined_names":0,"comments":0,"pivot_tables":0},"unopened":[],"bounds":{"document_bytes":16777216,"sheet_cells":100000,"rows_first":2000,"rows_last":500,"rows_between":2000,"halvings":0,"cell_chars":16384,"cell_head_chars":4096},"cells_cut":0,"cells_raw":0,"read":"whole","date_system":"1900"}

{"sheet":"Foglio1","index":0,"n_rows":21,"n_cols":4,"rows_kept":21,"cut":false,"hidden":false,"merged":[[0,0,0,5],[4,1,4,2],[4,3,4,4],[3,3,3,4],[2,3,2,4],[1,1,1,2],[1,3,1,4],[17,1,17,4],[6,2,6,3],[10,2,10,3],[2,1,2,2],[3,1,3,2]]}
["CALCOLO SANZIONI SCA AI SENSI DELL'ART. 24 COMMA 2 e 3 DEL d.P.R.. 380/2001"]
[null,{"$f":"B3","v":"2023-01-01"},null,{"$f":"D3","v":"2023-01-09T09:47:22"}]
[null,"2023-01-01",null,"2023-01-09T09:47:22"]
[null,"Inserire la data dopo il 15o GIORNO dall'ultimazione dei lavori di finitura dell'intervento e/o titoli edilizi",null,"Inserire la data della presentazione della SCA"]
[null,{"$f":"IF(fData(B3)=FALSE,\"ATTENZIONE DATA NON VALIDA\",\"DATA INSERITA CORRETTA\")","v":"DATA INSERITA CORRETTA"},null,{"$f":"IF(fData(D3)=FALSE,\"ATTENZIONE DATA NON VALIDA\",\"DATA INSERITA CORRETTA\")","v":"DATA INSERITA CORRETTA"}]
[]
[null,null,"Computo della sanzione amministrativa"]
[null,null,"VALORE CALCOLATO",{"$f":"IF(B19<1,0,VLOOKUP(B19,Foglio2!A2:D367,4))","v":77.184971098265891}]
[null,null,"VALORE ARRONTONDATO",{"$f":"MROUND(D8,1)","v":77}]
[]
[null,null,"Rapporto finale"]
[null,null,"Calcolo giorni trascorsi",{"$f":"B19","v":8}]
[null,null,"Calcolo mesi trascorsi",{"$f":"B19/30.4167","v":0.26301341039626258}]
[null,null,"Calcolo settimane trascorse",{"$f":"B19/7","v":1.1428571428571428}]
[null,null,"Calcolo anni trascorsi",{"$f":"B19*0.00273973","v":2.1917840000000001E-2}]
[null,null,"Sanzione calcolata",{"$f":"D8","v":77.184971098265891}]
[null,null,"Sanzione calcolata arrontondata",{"$f":"D9","v":77}]
[null,{"$f":"IF(D12=0,\"Non ci sono Sanzioni da versare\",IF(D12<0,\"ATTENZIONE INCONGRUENZA: La data della presentazione della SCA è minore della data del titolo edilizio\",IF(D12>0,\"Ci sono Sanzioni da versare, pari ad € \" & D17)))","v":"Ci sono Sanzioni da versare, pari ad € 77"}]
[null,{"$f":"_xlfn.DAYS(D3,B3)","v":8}]
[null,{"$f":"B5","v":"DATA INSERITA CORRETTA"},null,{"$f":"D5","v":"DATA INSERITA CORRETTA"}]
[null,{"$f":"ISERR(D12)","v":false}]

{"sheet":"Foglio2","index":1,"n_rows":367,"n_cols":11,"rows_kept":367,"cut":false,"hidden":true,"merged":[]}
["Giorni","Calcolo aliquota","Incremento","Valore"]
[1,{"$f":"(K$3/K$2)*A2","v":0.89405684754521964},{"$f":"(B2*A2)/K$2","v":2.3102244122615496E-3},{"$f":"77+C2","v":77.002310224412255},null,null,null,77,464,null,{"$f":"I2-H2","v":387}]
[2,{"$f":"(K$2/K$3)*A3","v":2.2369942196531793},1.1560693641618498E-2,77.011560693641613,null,null,null,19,365,null,{"$f":"I3-H3","v":346}]
[3,3.355491329479769,2.6011560693641623E-2,77.026011560693647]
[4,4.4739884393063587,4.6242774566473993E-2,77.04624277456648]
[5,5.5924855491329488,7.2254335260115612E-2,77.072254335260112]
[6,6.710982658959538,0.10404624277456649,77.104046242774572]
[7,7.8294797687861273,0.14161849710982657,77.141618497109832]
[8,8.9479768786127174,0.18497109826589597,77.184971098265891]
[9,10.066473988439308,0.23410404624277462,77.234104046242777]
[10,11.184971098265898,0.28901734104046245,77.289017341040463]
[11,12.303468208092486,0.3497109826589595,77.349710982658962]
[12,13.421965317919076,0.41618497109826597,77.416184971098261]
[13,14.540462427745666,0.48843930635838156,77.488439306358387]
[14,15.658959537572255,0.5664739884393063,77.566473988439313]
[15,16.777456647398846,0.6502890173410405,77.650289017341038]
[16,17.895953757225435,0.73988439306358389,77.739884393063591]
[17,19.014450867052023,0.83526011560693636,77.835260115606943]
[18,20.132947976878615,0.93641618497109846,77.936416184971094]
[19,21.251445086705203,1.0433526011560694,78.043352601156073]
[20,22.369942196531795,1.1560693641618498,78.156069364161851]
[21,23.488439306358384,1.2745664739884395,78.274566473988443]
[22,24.606936416184972,1.398843930635838,78.398843930635834]
[23,25.725433526011564,1.5289017341040463,78.528901734104039]
[24,26.843930635838152,1.6647398843930639,78.664739884393057]
[25,27.962427745664741,1.8063583815028903,78.806358381502889]
[26,29.080924855491332,1.9537572254335263,78.95375722543352]
[27,30.199421965317921,2.1069364161849711,79.106936416184965]
[28,31.317919075144509,2.2658959537572252,79.265895953757223]
[29,32.436416184971101,2.4306358381502893,79.430635838150295]
[30,33.554913294797693,2.601156069364162,79.601156069364166]
[31,34.673410404624278,2.7774566473988438,79.77745664739885]
[32,35.79190751445087,2.9595375722543356,79.959537572254334]
[33,36.910404624277461,3.147398843930636,80.147398843930631]
[34,38.028901734104046,3.3410404624277454,80.341040462427742]
[35,39.147398843930638,3.5404624277456653,80.540462427745666]
[36,40.26589595375723,3.7456647398843939,80.74566473988439]
[37,41.384393063583815,3.9566473988439306,80.956647398843927]
[38,42.502890173410407,4.1734104046242777,81.173410404624278]
[39,43.621387283236999,4.3959537572254339,81.395953757225428]
[40,44.739884393063591,4.6242774566473992,81.624277456647405]
[41,45.858381502890175,4.8583815028901736,81.858381502890168]
[42,46.976878612716767,5.0982658959537579,82.098265895953759]
[43,48.095375722543359,5.3439306358381513,82.343930635838149]
[44,49.213872832369944,5.595375722543352,82.595375722543352]
[45,50.332369942196536,5.8526011560693654,82.852601156069369]
[46,51.450867052023128,6.1156069364161851,83.115606936416185]
[47,52.569364161849713,6.3843930635838149,83.384393063583815]
[48,53.687861271676304,6.6589595375722554,83.658959537572258]
[49,54.806358381502896,6.9393063583815042,83.939306358381501]
[50,55.924855491329481,7.2254335260115612,84.225433526011557]
[51,57.043352601156073,7.517341040462429,84.517341040462426]
[52,58.161849710982665,7.815028901734105,84.815028901734109]
[53,59.28034682080925,8.1184971098265901,85.118497109826592]
[54,60.398843930635842,8.4277456647398843,85.427745664739888]
[55,61.517341040462433,8.7427745664739902,85.742774566473997]
[56,62.635838150289018,9.0635838150289008,86.063583815028906]
[57,63.75433526011561,9.3901734104046248,86.390173410404628]
[58,64.872832369942202,9.7225433526011571,86.72254335260115]
[59,65.991329479768794,10.060693641618499,87.060693641618499]
[60,67.109826589595386,10.404624277456648,87.404624277456648]
[61,68.228323699421964,10.754335260115607,87.75433526011561]
[62,69.346820809248555,11.109826589595375,88.109826589595372]
[63,70.465317919075147,11.471098265895954,88.471098265895961]
[64,71.583815028901739,11.838150289017342,88.838150289017335]
[65,72.702312138728331,{"$f":"(B66*A66)/K$2","v":12.210982658959539},89.210982658959537]
[66,{"$f":"(K$2/K$3)*A67","v":73.820809248554923},12.589595375722544,{"$f":"77+C67","v":89.589595375722539}]
[67,74.939306358381515,12.97398843930636,89.973988439306368]
[68,76.057803468208093,13.364161849710982,90.364161849710982]
[69,77.176300578034684,13.760115606936417,90.760115606936409]
[70,78.294797687861276,14.161849710982661,91.161849710982665]
[71,79.413294797687868,14.569364161849713,91.569364161849705]
[72,80.53179190751446,14.982658959537575,91.982658959537574]
[73,81.650289017341052,15.401734104046247,92.401734104046241]
[74,82.76878612716763,15.826589595375722,92.826589595375722]
[75,83.887283236994222,16.257225433526013,93.257225433526017]
[76,85.005780346820814,16.693641618497111,93.693641618497111]
[77,86.124277456647405,17.135838150289018,94.135838150289018]
[78,87.242774566473997,17.583815028901736,94.583815028901739]
[79,88.361271676300589,18.037572254335263,95.037572254335259]
[80,89.479768786127181,18.497109826589597,95.497109826589593]
[81,90.598265895953759,18.962427745664741,95.962427745664741]
[82,91.716763005780351,19.433526011560694,96.433526011560701]
[83,92.835260115606943,19.910404624277458,96.910404624277461]
[84,93.953757225433534,20.393063583815032,97.393063583815035]
[85,95.072254335260126,20.881502890173412,97.881502890173408]
[86,96.190751445086718,21.375722543352605,98.375722543352609]
[87,97.309248554913296,21.875722543352602,98.875722543352595]
[88,98.427745664739888,22.381502890173408,99.381502890173408]
[89,99.54624277456648,22.893063583815032,99.893063583815035]
[90,100.66473988439307,23.410404624277461,100.41040462427746]
[91,101.78323699421966,23.933526011560694,100.9335260115607]
[92,102.90173410404626,24.462427745664741,101.46242774566474]
[93,104.02023121387283,24.997109826589597,101.99710982658959]
[94,105.13872832369943,25.537572254335259,102.53757225433526]
[95,106.25722543352602,26.083815028901736,103.08381502890174]
[96,107.37572254335261,26.635838150289022,103.63583815028902]
[97,108.4942196531792,27.193641618497114,104.19364161849711]
[98,109.61271676300579,27.757225433526017,104.75722543352602]
[99,110.73121387283238,28.326589595375726,105.32658959537572]
[100,111.84971098265896,28.901734104046245,105.90173410404624]
[101,112.96820809248555,29.482658959537574,106.48265895953757]
[102,114.08670520231215,30.069364161849716,107.06936416184972]
[103,115.20520231213874,30.661849710982661,107.66184971098266]
[104,116.32369942196533,31.26011560693642,108.26011560693642]
[105,117.44219653179192,31.864161849710985,108.86416184971098]
[106,118.5606936416185,32.47398843930636,109.47398843930637]
[107,119.67919075144509,33.089595375722546,110.08959537572255]
[108,120.79768786127168,33.710982658959537,110.71098265895954]
[109,121.91618497109828,34.338150289017342,111.33815028901734]
[110,123.03468208092487,34.971098265895961,111.97109826589596]
[111,124.15317919075146,35.609826589595379,112.60982658959537]
[112,125.27167630057804,36.254335260115603,113.2543352601156]
[113,126.39017341040463,36.904624277456648,113.90462427745665]
[114,127.50867052023122,37.560693641618499,114.5606936416185]
[115,128.62716763005781,38.222543352601157,115.22254335260115]
[116,129.7456647398844,38.890173410404628,115.89017341040463]
[117,130.864161849711,39.563583815028906,116.56358381502891]
[118,131.98265895953759,40.242774566473997,117.242774566474]
[119,133.10115606936418,40.927745664739888,117.92774566473989]
[120,134.21965317919077,41.618497109826592,118.61849710982659]
[121,135.33815028901736,42.315028901734117,119.31502890173411]
[122,136.45664739884393,43.017341040462426,120.01734104046243]
[123,137.57514450867052,43.725433526011564,120.72543352601156]
[124,138.69364161849711,44.439306358381501,121.4393063583815]
[125,139.8121387283237,45.158959537572258,122.15895953757226]
[126,140.93063583815029,45.884393063583815,122.88439306358381]
[127,142.04913294797689,46.615606936416185,123.61560693641619]
[128,143.16763005780348,47.352601156069369,124.35260115606937]
[129,144.28612716763007,{"$f":"(B130*A130)/K$2","v":48.095375722543359},125.09537572254337]
[130,{"$f":"(K$2/K$3)*A131","v":145.40462427745666},48.843930635838156,{"$f":"77+C131","v":125.84393063583815}]
[131,146.52312138728325,49.598265895953759,126.59826589595376]
[132,147.64161849710985,50.358381502890175,127.35838150289018]
[133,148.76011560693644,51.124277456647405,128.12427745664741]
[134,149.87861271676303,51.895953757225442,128.89595375722544]
[135,150.99710982658959,52.673410404624278,129.67341040462429]
[136,152.11560693641619,53.456647398843927,130.45664739884393]
[137,153.23410404624278,54.245664739884397,131.2456647398844]
[138,154.35260115606937,55.040462427745666,132.04046242774567]
[139,155.47109826589596,55.841040462427749,132.84104046242774]
[140,156.58959537572255,56.647398843930645,133.64739884393066]
[141,157.70809248554914,57.459537572254341,134.45953757225433]
[142,158.82658959537574,58.27745664739885,135.27745664739885]
[143,159.94508670520233,59.101156069364166,136.10115606936415]
[144,161.06358381502892,59.930635838150302,136.93063583815029]
[145,162.18208092485551,60.76589595375723,137.76589595375722]
[146,163.3005780346821,61.606936416184986,138.60693641618499]
[147,164.4190751445087,62.453757225433534,139.45375722543355]
[148,165.53757225433526,63.306358381502889,140.30635838150289]
[149,166.65606936416185,64.164739884393072,141.16473988439307]
[150,167.77456647398844,65.028901734104053,142.02890173410407]
[151,168.89306358381504,65.898843930635849,142.89884393063585]
[152,170.01156069364163,66.774566473988443,143.77456647398844]
[153,171.13005780346822,67.656069364161851,144.65606936416185]
[154,172.24855491329481,68.543352601156073,145.54335260115607]
[155,173.3670520231214,69.436416184971108,146.43641618497111]
[156,174.48554913294799,70.335260115606943,147.33526011560696]
[157,175.60404624277459,71.239884393063591,148.23988439306359]
[158,176.72254335260118,72.150289017341052,149.15028901734104]
[159,177.84104046242777,73.066473988439313,150.06647398843933]
[160,178.95953757225436,73.988439306358387,150.98843930635837]
[161,180.07803468208093,74.916184971098275,151.91618497109829]
[162,181.19653179190752,75.849710982658962,152.84971098265896]
[163,182.31502890173411,76.789017341040463,153.78901734104045]
[164,183.4335260115607,77.734104046242777,154.73410404624278]
[165,184.55202312138729,78.684971098265891,155.68497109826589]
[166,185.67052023121389,79.641618497109832,156.64161849710985]
[167,186.78901734104048,80.604046242774572,157.60404624277459]
[168,187.90751445086707,81.572254335260126,158.57225433526014]
[169,189.02601156069366,82.54624277456648,159.54624277456648]
[170,190.14450867052025,83.526011560693647,160.52601156069363]
[171,191.26300578034684,84.511560693641627,161.51156069364163]
[172,192.38150289017344,85.502890173410421,162.50289017341044]
[173,193.5,86.5,163.5]
[174,194.61849710982659,87.502890173410407,164.50289017341041]
[175,195.73699421965318,88.511560693641613,165.51156069364163]
[176,196.85549132947978,89.526011560693632,166.52601156069363]
[177,197.97398843930637,90.54624277456648,167.54624277456648]
[178,199.09248554913296,91.572254335260126,168.57225433526014]
[179,200.21098265895955,92.604046242774572,169.60404624277459]
[180,201.32947976878614,93.641618497109846,170.64161849710985]
[181,202.44797687861274,94.684971098265905,171.68497109826592]
[182,203.56647398843933,95.734104046242777,172.73410404624278]
[183,204.68497109826592,96.789017341040477,173.78901734104048]
[184,205.80346820809251,97.849710982658962,174.84971098265896]
[185,206.9219653179191,98.916184971098275,175.91618497109829]
[186,208.04046242774567,99.988439306358387,176.98843930635837]
[187,209.15895953757226,101.06647398843931,178.06647398843933]
[188,210.27745664739885,102.15028901734104,179.15028901734104]
[189,211.39595375722544,103.23988439306359,180.23988439306359]
[190,212.51445086705203,104.33526011560694,181.33526011560696]
[191,213.63294797687863,105.43641618497111,182.43641618497111]
[192,214.75144508670522,106.54335260115609,183.54335260115607]
[193,215.86994219653181,{"$f":"(B194*A194)/K$2","v":107.65606936416187},184.65606936416185]
[194,{"$f":"(K$2/K$3)*A195","v":216.9884393063584},108.77456647398846,{"$f":"77+C195","v":185.77456647398844}]
[195,218.10693641618499,109.89884393063585,186.89884393063585]
[196,219.22543352601159,111.02890173410407,188.02890173410407]
[197,220.34393063583818,112.16473988439307,189.16473988439307]
[198,221.46242774566477,113.3063583815029,190.30635838150289]
[199,222.58092485549133,114.45375722543353,191.45375722543355]
[200,223.69942196531792,115.60693641618498,192.60693641618496]
[201,224.81791907514452,116.76589595375722,193.76589595375722]
[202,225.93641618497111,117.93063583815029,194.93063583815029]
[203,227.0549132947977,119.10115606936417,196.10115606936415]
[204,228.17341040462429,120.27745664739886,197.27745664739888]
[205,229.29190751445088,121.45953757225435,198.45953757225436]
[206,230.41040462427748,122.64739884393065,199.64739884393066]
[207,231.52890173410407,123.84104046242776,200.84104046242777]
[208,232.64739884393066,125.04046242774568,202.04046242774569]
[209,233.76589595375725,126.24566473988442,203.24566473988443]
[210,234.88439306358384,127.45664739884394,204.45664739884393]
[211,236.00289017341044,128.67341040462429,205.67341040462429]
[212,237.121387283237,129.89595375722544,206.89595375722544]
[213,238.23988439306359,131.12427745664741,208.12427745664741]
[214,239.35838150289018,132.35838150289018,209.35838150289018]
[215,240.47687861271677,133.59826589595377,210.59826589595377]
[216,241.59537572254337,134.84393063583815,211.84393063583815]
[217,242.71387283236996,136.09537572254337,213.09537572254337]
[218,243.83236994219655,137.35260115606937,214.35260115606937]
[219,244.95086705202314,138.61560693641621,215.61560693641621]
[220,246.06936416184973,139.88439306358384,216.88439306358384]
[221,247.18786127167633,141.15895953757226,218.15895953757226]
[222,248.30635838150292,142.43930635838151,219.43930635838151]
[223,249.42485549132951,143.72543352601159,220.72543352601159]
[224,250.54335260115607,145.01734104046241,222.01734104046241]
[225,251.66184971098266,146.31502890173411,223.31502890173411]
[226,252.78034682080926,147.61849710982659,224.61849710982659]
[227,253.89884393063585,148.92774566473989,225.92774566473989]
[228,255.01734104046244,150.242774566474,227.242774566474]
[229,256.13583815028903,151.56358381502892,228.56358381502892]
[230,257.25433526011562,152.89017341040463,229.89017341040463]
[231,258.37283236994222,154.22254335260115,231.22254335260115]
[232,259.49132947976881,155.56069364161851,232.56069364161851]
[233,260.6098265895954,156.90462427745666,233.90462427745666]
[234,261.72832369942199,158.25433526011562,235.25433526011562]
[235,262.84682080924858,159.6098265895954,236.6098265895954]
[236,263.96531791907518,160.97109826589599,237.97109826589599]
[237,265.08381502890177,162.33815028901736,239.33815028901736]
[238,266.20231213872836,163.71098265895955,240.71098265895955]
[239,267.32080924855495,165.08959537572258,242.08959537572258]
[240,268.43930635838154,166.47398843930637,243.47398843930637]
[241,269.55780346820814,167.864161849711,244.864161849711]
[242,270.67630057803473,169.26011560693647,246.26011560693647]
[243,271.79479768786132,170.66184971098266,247.66184971098266]
[244,272.91329479768785,172.06936416184971,249.06936416184971]
[245,274.03179190751445,173.48265895953759,250.48265895953759]
[246,275.15028901734104,174.90173410404626,251.90173410404626]
[247,276.26878612716763,176.32658959537571,253.32658959537571]
[248,277.38728323699422,177.757225433526,254.757225433526]
[249,278.50578034682081,179.19364161849711,256.19364161849711]
[250,279.62427745664741,180.63583815028903,257.63583815028903]
[251,280.742774566474,182.08381502890171,259.08381502890171]
[252,281.86127167630059,183.53757225433526,260.53757225433526]
[253,282.97976878612718,184.99710982658959,261.99710982658962]
[254,284.09826589595377,186.46242774566474,263.46242774566474]
[255,285.21676300578036,187.9335260115607,264.93352601156073]
[256,286.33526011560696,189.41040462427748,266.41040462427748]
[257,287.45375722543355,{"$f":"(B258*A258)/K$2","v":190.89306358381504},267.89306358381504]
[258,{"$f":"(K$2/K$3)*A259","v":288.57225433526014},192.38150289017344,{"$f":"77+C259","v":269.38150289017346}]
[259,289.69075144508673,193.87572254335262,270.87572254335259]
[260,290.80924855491332,195.37572254335262,272.37572254335259]
[261,291.92774566473992,196.88150289017344,273.88150289017346]
[262,293.04624277456651,198.39306358381504,275.39306358381504]
[263,294.1647398843931,199.91040462427748,276.91040462427748]
[264,295.28323699421969,201.4335260115607,278.43352601156073]
[265,296.40173410404628,202.96242774566477,279.96242774566474]
[266,297.52023121387288,204.49710982658962,281.49710982658962]
[267,298.63872832369947,206.03757225433529,283.03757225433526]
[268,299.75722543352606,207.58381502890177,284.58381502890177]
[269,300.87572254335259,209.135838150289,286.13583815028903]
[270,301.99421965317919,210.69364161849711,287.69364161849711]
[271,303.11271676300578,212.257225433526,289.257225433526]
[272,304.23121387283237,213.82658959537571,290.82658959537571]
[273,305.34971098265896,215.40173410404626,292.40173410404623]
[274,306.46820809248555,216.98265895953759,293.98265895953762]
[275,307.58670520231215,218.56936416184971,295.56936416184971]
[276,308.70520231213874,220.16184971098266,297.16184971098266]
[277,309.82369942196533,221.76011560693641,298.76011560693644]
[278,310.94219653179192,223.364161849711,300.36416184971097]
[279,312.06069364161851,224.97398843930637,301.97398843930637]
[280,313.17919075144511,226.58959537572258,303.58959537572258]
[281,314.2976878612717,228.21098265895955,305.21098265895955]
[282,315.41618497109829,229.83815028901736,306.83815028901734]
[283,316.53468208092488,231.47109826589596,308.47109826589599]
[284,317.65317919075147,233.1098265895954,310.1098265895954]
[285,318.77167630057806,234.75433526011565,311.75433526011568]
[286,319.89017341040466,236.40462427745666,313.40462427745666]
[287,321.00867052023125,238.06069364161851,315.06069364161851]
[288,322.12716763005784,239.72254335260121,316.72254335260118]
[289,323.24566473988443,241.39017341040463,318.3901734104046]
[290,324.36416184971102,243.06358381502892,320.06358381502889]
[291,325.48265895953762,244.74277456647403,321.74277456647405]
[292,326.60115606936421,246.42774566473994,323.42774566473997]
[293,327.7196531791908,248.11849710982662,325.11849710982665]
[294,328.83815028901739,249.81502890173414,326.81502890173414]
[295,329.95664739884393,251.51734104046241,328.51734104046238]
[296,331.07514450867052,253.22543352601156,330.22543352601156]
[297,332.19364161849711,254.93930635838151,331.93930635838149]
[298,333.3121387283237,256.65895953757229,333.65895953757229]
[299,334.43063583815029,258.38439306358384,335.38439306358384]
[300,335.54913294797689,260.11560693641621,337.11560693641621]
[301,336.66763005780348,261.8526011560694,338.8526011560694]
[302,337.78612716763007,263.59537572254339,340.59537572254339]
[303,338.90462427745666,265.34393063583815,342.34393063583815]
[304,340.02312138728325,267.09826589595377,344.09826589595377]
[305,341.14161849710985,268.85838150289021,345.85838150289021]
[306,342.26011560693644,270.62427745664741,347.62427745664741]
[307,343.37861271676303,272.39595375722547,349.39595375722547]
[308,344.49710982658962,274.17341040462429,351.17341040462429]
[309,345.61560693641621,275.95664739884393,352.95664739884393]
[310,346.73410404624281,277.74566473988443,354.74566473988443]
[311,347.8526011560694,279.54046242774569,356.54046242774569]
[312,348.97109826589599,281.34104046242777,358.34104046242777]
[313,350.08959537572258,283.14739884393066,360.14739884393066]
[314,351.20809248554917,284.95953757225436,361.95953757225436]
[315,352.32658959537576,286.77745664739888,363.77745664739888]
[316,353.44508670520236,288.60115606936421,365.60115606936421]
[317,354.56358381502895,290.43063583815035,367.43063583815035]
[318,355.68208092485554,292.26589595375725,369.26589595375725]
[319,356.80057803468213,294.10693641618502,371.10693641618502]
[320,357.91907514450872,295.95375722543355,372.95375722543355]
[321,359.03757225433526,{"$f":"(B322*A322)/K$2","v":297.80635838150289},374.80635838150289]
[322,{"$f":"(K$2/K$3)*A323","v":360.15606936416185},299.6647398843931,{"$f":"77+C323","v":376.6647398843931}]
[323,361.27456647398844,301.52890173410407,378.52890173410407]
[324,362.39306358381504,303.39884393063585,380.39884393063585]
[325,363.51156069364163,305.27456647398844,382.27456647398844]
[326,364.63005780346822,307.15606936416185,384.15606936416185]
[327,365.74855491329481,309.04335260115607,386.04335260115607]
[328,366.8670520231214,310.93641618497111,387.93641618497111]
[329,367.98554913294799,312.83526011560696,389.83526011560696]
[330,369.10404624277459,314.73988439306356,391.73988439306356]
[331,370.22254335260118,316.65028901734104,393.65028901734104]
[332,371.34104046242777,318.56647398843933,395.56647398843933]
[333,372.45953757225436,320.48843930635843,397.48843930635843]
[334,373.57803468208095,322.41618497109829,399.41618497109829]
[335,374.69653179190755,324.34971098265896,401.34971098265896]
[336,375.81502890173414,326.28901734104051,403.28901734104051]
[337,376.93352601156073,328.23410404624281,405.23410404624281]
[338,378.05202312138732,330.18497109826592,407.18497109826592]
[339,379.17052023121391,332.1416184971099,409.1416184971099]
[340,380.28901734104051,334.10404624277459,411.10404624277459]
[341,381.4075144508671,336.07225433526014,413.07225433526014]
[342,382.52601156069369,338.04624277456651,415.04624277456651]
[343,383.64450867052028,340.02601156069369,417.02601156069369]
[344,384.76300578034687,342.01156069364168,419.01156069364168]
[345,385.88150289017346,344.00289017341049,421.00289017341049]
[346,387,346,423]
[347,388.11849710982659,348.00289017341038,425.00289017341038]
[348,389.23699421965318,350.01156069364163,427.01156069364163]
[349,390.35549132947978,352.02601156069363,429.02601156069363]
[350,391.47398843930637,354.04624277456645,431.04624277456645]
[351,392.59248554913296,356.07225433526008,433.07225433526008]
[352,393.71098265895955,358.10404624277453,435.10404624277453]
[353,394.82947976878614,360.14161849710979,437.14161849710979]
[354,395.94797687861274,362.18497109826592,439.18497109826592]
[355,397.06647398843933,364.23410404624281,441.23410404624281]
[356,398.18497109826592,366.28901734104051,443.28901734104051]
[357,399.30346820809251,368.34971098265896,445.34971098265896]
[358,400.4219653179191,370.41618497109829,447.41618497109829]
[359,401.54046242774569,372.48843930635837,449.48843930635837]
[360,402.65895953757229,374.56647398843938,451.56647398843938]
[361,403.77745664739888,376.65028901734109,453.65028901734109]
[362,404.89595375722547,378.73988439306362,455.73988439306362]
[363,406.01445086705206,380.83526011560696,457.83526011560696]
[364,407.13294797687865,382.93641618497111,459.93641618497111]
[365,408.25144508670525,385.04335260115613,462.04335260115613]
[366,409.36994219653184,387.15606936416191,464.15606936416191]